BDBM50051193 (3-Nitro-benzyl)-carbamic acid 3-(1H-imidazol-4-yl)-propyl ester::CHEMBL277537
SMILES [O-][N+](=O)c1cccc(CNC(=O)OCCCc2cnc[nH]2)c1
InChI Key InChIKey=JEGKJVGFTGBOQM-UHFFFAOYSA-N
Data  4 KI
  Tab Delimited (TSV)   2D SDfile   Computed 3D by Vconf -m prep SDfile
Find this compound or compounds like it in BindingDB:
Activity Spreadsheet -- Enzyme Inhibition Constant Data from BindingDB
Found 4 hits for monomerid = 50051193
TargetHistamine H3 receptor(Rattus norvegicus (rat))
Freie UniversitäT Berlin
Curated by ChEMBL
LigandPNGBDBM50051193((3-Nitro-benzyl)-carbamic acid 3-(1H-imidazol-4-yl...)
Affinity DataKi:  12.6nM. Assay description: Binding affinity against Histamine H3 receptor on Synaptosomes from rat cerebral cortex was evaluated
In DepthDetails ArticlePubMed
TargetHistamine H3 receptor(Rattus norvegicus (rat))
Freie UniversitäT Berlin
Curated by ChEMBL
LigandPNGBDBM50051193((3-Nitro-benzyl)-carbamic acid 3-(1H-imidazol-4-yl...)
Affinity DataKi:  13nM. Assay description: In vitro antagonistic activity of the compound against Histamine H3 receptor on Synaptosomes of rat cerebral cortex.
In DepthDetails ArticlePubMed
TargetHistamine H2 receptor(Cavia porcellus (domestic guinea pig))
Freie UniversitäT Berlin
Curated by ChEMBL
LigandPNGBDBM50051193((3-Nitro-benzyl)-carbamic acid 3-(1H-imidazol-4-yl...)
Affinity DataKi:  1.00E+3nM. Assay description: Binding affinity against H2 receptor of Guinea pig atrium
In DepthDetails ArticlePubMed
TargetHistamine H1 receptor(Cavia porcellus (domestic guinea pig))
Freie UniversitäT Berlin
Curated by ChEMBL
LigandPNGBDBM50051193((3-Nitro-benzyl)-carbamic acid 3-(1H-imidazol-4-yl...)
Affinity DataKi:  5.01E+4nM. Assay description: Binding affinity against H1 receptor of Guinea pig ileum
In DepthDetails ArticlePubMed