BDBM50051330 (5,6-Dimethyl-7H-pyrrolo[2,3-d]pyrimidin-4-yl)-(3-trifluoromethyl-phenyl)-amine::CHEMBL306029
SMILES Cc1[nH]c2ncnc(Nc3cccc(c3)C(F)(F)F)c2c1C
InChI Key InChIKey=DIOHUOGBSVXUTJ-UHFFFAOYSA-N
Data  1 IC50
  Tab Delimited (TSV)   2D SDfile   Computed 3D by Vconf -m prep SDfile
Find this compound or compounds like it in BindingDB:
Activity Spreadsheet -- Enzyme Inhibition Constant Data from BindingDB
Found 1 hit for monomerid = 50051330
TargetEpidermal growth factor receptor(Homo sapiens (Human))
Ciba Pharmaceuticals
Curated by ChEMBL
LigandPNGBDBM50051330((5,6-Dimethyl-7H-pyrrolo[2,3-d]pyrimidin-4-yl)-(3-...)
Affinity DataIC50:  1.90E+3nM. Assay description: In vitro inhibitory activity against epidermal growth factor receptor
In DepthDetails ArticlePubMed