BDBM50051333 3-(5,6-Dimethyl-7H-pyrrolo[2,3-d]pyrimidin-4-ylamino)-benzonitrile::CHEMBL75208
SMILES Cc1[nH]c2ncnc(Nc3cccc(c3)C#N)c2c1C
InChI Key InChIKey=MPFUPSNMAKEAKB-UHFFFAOYSA-N
Data  1 IC50
  Tab Delimited (TSV)   2D SDfile   Computed 3D by Vconf -m prep SDfile
Find this compound or compounds like it in BindingDB:
Activity Spreadsheet -- Enzyme Inhibition Constant Data from BindingDB
Found 1 hit for monomerid = 50051333
TargetEpidermal growth factor receptor(Homo sapiens (Human))
Ciba Pharmaceuticals
Curated by ChEMBL
LigandPNGBDBM50051333(3-(5,6-Dimethyl-7H-pyrrolo[2,3-d]pyrimidin-4-ylami...)
Affinity DataIC50:  200nM. Assay description: In vitro inhibitory activity against epidermal growth factor receptor
In DepthDetails ArticlePubMed