BDBM50052127 Acetic acid (3R,4aR,5S,6S,6aS,10S,10aR,10bS)-10,10b-dihydroxy-3,4a,7,7,10a-pentamethyl-1-oxo-6-propylcarbamoyloxy-3-vinyl-dodecahydro-benzo[f]chromen-5-yl ester::CHEMBL329916
SMILES CCCNC(=O)O[C@@H]1[C@H](OC(C)=O)[C@@]2(C)O[C@](C)(CC(=O)[C@]2(O)[C@@]2(C)[C@@H](O)CCC(C)(C)[C@H]12)C=C
InChI Key InChIKey=LUAMGWQEEINJGO-VYHDIKPLSA-N
Data  1 IC50  2 EC50
  Tab Delimited (TSV)   2D SDfile   Computed 3D by Vconf -m prep SDfile
Find this compound or compounds like it in BindingDB:
Activity Spreadsheet -- Enzyme Inhibition Constant Data from BindingDB
Found 3 hits for monomerid = 50052127
TargetAdenylate cyclase type 1(Homo sapiens (Human))
Food And Drug Administration
Curated by ChEMBL
LigandPNGBDBM50052127(Acetic acid (3R,4aR,5S,6S,6aS,10S,10aR,10bS)-10,10...)
Affinity DataEC50: >2.00E+3nM. Assay description: Ability to activate the conversion of [32P] ATP to [32P]-cyclic AMP mediated by adenylate cyclase 1
In DepthDetails ArticlePubMed
TargetAdenylate cyclase type 1(Homo sapiens (Human))
Food And Drug Administration
Curated by ChEMBL
LigandPNGBDBM50052127(Acetic acid (3R,4aR,5S,6S,6aS,10S,10aR,10bS)-10,10...)
Affinity DataEC50:  4.30E+3nM. Assay description: Conversion of [32P] ATP to [32P]-cyclic AMP mediated by adenylate cyclase 1
In DepthDetails ArticlePubMed
TargetAdenylate cyclase type 1(Homo sapiens (Human))
Food And Drug Administration
Curated by ChEMBL
LigandPNGBDBM50052127(Acetic acid (3R,4aR,5S,6S,6aS,10S,10aR,10bS)-10,10...)
Affinity DataIC50:  76nM. Assay description: Inhibition of [125 I]-6-IHPP-forskolin binding to adenylate cyclase 1
In DepthDetails ArticlePubMed