BDBM50052133 Acetic acid (3R,4aR,5S,6S,6aS,10S,10aR,10bS)-6-cyclohexylmethylcarbamoyloxy-10,10b-dihydroxy-3,4a,7,7,10a-pentamethyl-1-oxo-3-vinyl-dodecahydro-benzo[f]chromen-5-yl ester::CHEMBL92577
SMILES CC(=O)O[C@H]1[C@@H](OC(=O)NCC2CCCCC2)[C@H]2C(C)(C)CC[C@H](O)[C@]2(C)[C@@]2(O)C(=O)C[C@@](C)(O[C@]12C)C=C
InChI Key InChIKey=OBJZIYFSENTWIJ-WYEYVKMPSA-N
Data  2 IC50  2 EC50
  Tab Delimited (TSV)   2D SDfile   Computed 3D by Vconf -m prep SDfile
Find this compound or compounds like it in BindingDB:
Activity Spreadsheet -- Enzyme Inhibition Constant Data from BindingDB
Found 4 hits for monomerid = 50052133
TargetAdenylate cyclase type 1(Homo sapiens (Human))
Food And Drug Administration
Curated by ChEMBL
LigandPNGBDBM50052133(Acetic acid (3R,4aR,5S,6S,6aS,10S,10aR,10bS)-6-cyc...)
Affinity DataEC50:  6.60E+3nM. Assay description: Conversion of [32P] ATP to [32P]-cyclic AMP mediated by adenylate cyclase 1
In DepthDetails ArticlePubMed
TargetAdenylate cyclase type 1(Homo sapiens (Human))
Food And Drug Administration
Curated by ChEMBL
LigandPNGBDBM50052133(Acetic acid (3R,4aR,5S,6S,6aS,10S,10aR,10bS)-6-cyc...)
Affinity DataIC50: >150nM. Assay description: Inhibition of [125 I]-6-IHPP-forskolin binding to adenylate cyclase 1
In DepthDetails ArticlePubMed
TargetAdenylate cyclase type 1(Homo sapiens (Human))
Food And Drug Administration
Curated by ChEMBL
LigandPNGBDBM50052133(Acetic acid (3R,4aR,5S,6S,6aS,10S,10aR,10bS)-6-cyc...)
Affinity DataIC50:  117nM. Assay description: Inhibition of [125 I]-6-IHPP-forskolin binding to adenylate cyclase 1
In DepthDetails ArticlePubMed
TargetAdenylate cyclase type 1(Homo sapiens (Human))
Food And Drug Administration
Curated by ChEMBL
LigandPNGBDBM50052133(Acetic acid (3R,4aR,5S,6S,6aS,10S,10aR,10bS)-6-cyc...)
Affinity DataEC50: >2.00E+3nM. Assay description: Ability to activate the conversion of [32P] ATP to [32P]-cyclic AMP mediated by adenylate cyclase 1
In DepthDetails ArticlePubMed