BDBM50052140 Acetic acid (3R,4aR,5S,6S,6aS,10S,10aR,10bS)-10,10b-dihydroxy-3,4a,7,7,10a-pentamethyl-1-oxo-6-(2-piperidin-1-yl-ethylcarbamoyloxy)-3-vinyl-dodecahydro-benzo[f]chromen-5-yl ester::CHEMBL430458
SMILES CC(=O)O[C@H]1[C@@H](OC(=O)NCCN2CCCCC2)[C@H]2C(C)(C)CC[C@H](O)[C@]2(C)[C@@]2(O)C(=O)C[C@@](C)(O[C@]12C)C=C
InChI Key InChIKey=SUPYJIZPADRWLK-WYEYVKMPSA-N
Data  1 IC50  1 EC50
  Tab Delimited (TSV)   2D SDfile   Computed 3D by Vconf -m prep SDfile
Find this compound or compounds like it in BindingDB:
Activity Spreadsheet -- Enzyme Inhibition Constant Data from BindingDB
Found 2 hits for monomerid = 50052140
TargetAdenylate cyclase type 1(Homo sapiens (Human))
Food And Drug Administration
Curated by ChEMBL
LigandPNGBDBM50052140(Acetic acid (3R,4aR,5S,6S,6aS,10S,10aR,10bS)-10,10...)
Affinity DataIC50:  82nM. Assay description: Inhibition of [125 I]-6-IHPP-forskolin binding to adenylate cyclase 1
In DepthDetails ArticlePubMed
TargetAdenylate cyclase type 1(Homo sapiens (Human))
Food And Drug Administration
Curated by ChEMBL
LigandPNGBDBM50052140(Acetic acid (3R,4aR,5S,6S,6aS,10S,10aR,10bS)-10,10...)
Affinity DataEC50:  500nM. Assay description: Conversion of [32P] ATP to [32P]-cyclic AMP mediated by adenylate cyclase 1
In DepthDetails ArticlePubMed