BDBM50052231 CHEMBL3322717
SMILES Cc1c(sc2ccccc12)C1CN(C1)C(=O)\C=C\c1cnc2NC(=O)CCc2c1
InChI Key InChIKey=AFINXHDSKJHHKG-RMKNXTFCSA-N
Data  1 IC50
  Tab Delimited (TSV)   2D SDfile   Computed 3D by Vconf -m prep SDfile
Find this compound or compounds like it in BindingDB:
Activity Spreadsheet -- Enzyme Inhibition Constant Data from BindingDB
Found 1 hit for monomerid = 50052231
TargetEnoyl-[acyl-carrier-protein] reductase [NADPH] FabI [9-251](Staphylococcus aureus)
Aurigene Discovery Technologies
Curated by ChEMBL
LigandPNGBDBM50052231(CHEMBL3322717)
Affinity DataIC50:  709nM. Assay description: Inhibition of Staphylococcus aureus FabI-mediated reduction of enoyl-ACP preincubated for 30 mins measured after 2 hrs by spectrophotometry
In DepthDetails ArticlePubMed