BDBM50052465 1,8-Dihydroxy-10-(4-methoxy-benzylsulfanyl)-10H-anthracen-9-one::CHEMBL105777
SMILES COc1ccc(CSC2c3cccc(O)c3C(=O)c3c(O)cccc23)cc1
InChI Key InChIKey=ZJBANYOUDWJPMR-UHFFFAOYSA-N
Data  2 IC50
  Tab Delimited (TSV)   2D SDfile   Computed 3D by Vconf -m prep SDfile
Find this compound or compounds like it in BindingDB:
Activity Spreadsheet -- Enzyme Inhibition Constant Data from BindingDB
Found 2 hits for monomerid = 50052465
Target5-lipoxygenase(Bos taurus)
UniversitäT Regensburg
Curated by ChEMBL
LigandPNGBDBM50052465(1,8-Dihydroxy-10-(4-methoxy-benzylsulfanyl)-10H-an...)
Affinity DataIC50: >3.00E+4nM. Assay description: Tested for inhibition of 5-lipoxygenase as inhibition of 5-HETE and LTB4 biosynthesis in bovine PMNL
In DepthDetails ArticlePubMed
TargetPolyunsaturated fatty acid lipoxygenase ALOX12(Mus musculus)
UniversitäT Regensburg
Curated by ChEMBL
LigandPNGBDBM50052465(1,8-Dihydroxy-10-(4-methoxy-benzylsulfanyl)-10H-an...)
Affinity DataIC50:  3.00E+4nM. Assay description: Tested for inhibition of 12-LO (12-lipoxygenase) as an inhibitor of 12(S)-HETE biosynthesis in mouse epidermal homogenates
In DepthDetails ArticlePubMed