BDBM50052474 (4,5-Dihydroxy-10-oxo-9,10-dihydro-anthracen-9-ylsulfanyl)-acetic acid::CHEMBL541721
SMILES OC(=O)CSC1c2cccc(O)c2C(=O)c2c(O)cccc12
InChI Key InChIKey=ANXSXHVKPNUULX-UHFFFAOYSA-N
Data  2 IC50
  Tab Delimited (TSV)   2D SDfile   Computed 3D by Vconf -m prep SDfile
Find this compound or compounds like it in BindingDB:
Activity Spreadsheet -- Enzyme Inhibition Constant Data from BindingDB
Found 2 hits for monomerid = 50052474
Target5-lipoxygenase(Bos taurus)
UniversitäT Regensburg
Curated by ChEMBL
LigandPNGBDBM50052474((4,5-Dihydroxy-10-oxo-9,10-dihydro-anthracen-9-yls...)
Affinity DataIC50: >3.00E+4nM. Assay description: Tested for inhibition of 5-lipoxygenase as inhibition of 5-HETE and LTB4 biosynthesis in bovine PMNL
In DepthDetails ArticlePubMed
TargetPolyunsaturated fatty acid lipoxygenase ALOX12(Mus musculus)
UniversitäT Regensburg
Curated by ChEMBL
LigandPNGBDBM50052474((4,5-Dihydroxy-10-oxo-9,10-dihydro-anthracen-9-yls...)
Affinity DataIC50:  3.00E+4nM. Assay description: Tested for inhibition of 12-LO (12-lipoxygenase) as an inhibitor of 12(S)-HETE biosynthesis in mouse epidermal homogenates
In DepthDetails ArticlePubMed