BDBM50052603 3-(1,3-Dioxo-1,3-dihydro-isoindol-2-yl)-3-(4-methoxy-phenyl)-propionamide::CHEMBL111973
SMILES COc1ccc(cc1)C(CC(N)=O)N1C(=O)c2ccccc2C1=O
InChI Key InChIKey=HYAWNYVAQOMCFV-UHFFFAOYSA-N
Data  1 IC50
  Tab Delimited (TSV)   2D SDfile   Computed 3D by Vconf -m prep SDfile
Find this compound or compounds like it in BindingDB:
Activity Spreadsheet -- Enzyme Inhibition Constant Data from BindingDB
Found 1 hit for monomerid = 50052603
TargetTumor necrosis factor(Homo sapiens (Human))
Celgene
Curated by ChEMBL
LigandPNGBDBM50052603(3-(1,3-Dioxo-1,3-dihydro-isoindol-2-yl)-3-(4-metho...)
Affinity DataIC50:  6.20E+4nM. Assay description: Inhibition of TNF-alpha production in LPS stimulated human PBMCs
In DepthDetails ArticlePubMed