BDBM50052687 CHEMBL114705::N-[5-(3-Cyclohexyl-propionylamino)-2-methyl-phenyl]-nicotinamide
SMILES Cc1ccc(NC(=O)CCC2CCCCC2)cc1NC(=O)c1cccnc1
InChI Key InChIKey=JRTFWXSLVFPRGP-UHFFFAOYSA-N
Data  1 EC50
  Tab Delimited (TSV)   2D SDfile   Computed 3D by Vconf -m prep SDfile
Find this compound or compounds like it in BindingDB:
Activity Spreadsheet -- Enzyme Inhibition Constant Data from BindingDB
Found 1 hit for monomerid = 50052687
TargetLow-density lipoprotein receptor(Homo sapiens (Human))
RhôNe-Poulenc Rorer
Curated by ChEMBL
LigandPNGBDBM50052687(CHEMBL114705 | N-[5-(3-Cyclohexyl-propionylamino)-...)
Affinity DataEC50:  1.20E+3nM. Assay description: Concentration at which one-half of the maximum Low density lipoprotein receptor is upregulated in HepG2 cells
In DepthDetails ArticlePubMed