BDBM50052832 CHEMBL3318753
SMILES OC[C@H]1OC(O)[C@H](O)[C@@H](OC(=O)c2cc(O)c(O)c(O)c2)[C@@H]1O
InChI Key InChIKey=MWEAKAFRGMFWAV-RREHWXIASA-N
Data  1 IC50
  Tab Delimited (TSV)   2D SDfile   Computed 3D by Vconf -m prep SDfile
Find this compound or compounds like it in BindingDB:
Activity Spreadsheet -- Enzyme Inhibition Constant Data from BindingDB
Found 1 hit for monomerid = 50052832
TargetPoly(ADP-ribose) glycohydrolase(Rattus norvegicus)
Kumamoto Health Science University
Curated by ChEMBL
LigandPNGBDBM50052832(CHEMBL3318753)
Affinity DataIC50:  950nM. Assay description: Inhibition of rat testis GST-tagged PARG catalytic activity after 30 mins using [32P]poly(ADP-ribose) by radioassay
In DepthDetails ArticlePubMed