BDBM50052885 (R)-3-Methyl-1,2,3,4-tetrahydro-isoquinoline::CHEMBL293023
SMILES C[C@@H]1Cc2ccccc2CN1
InChI Key InChIKey=UEKQPSAKUNXFHL-MRVPVSSYSA-N
Data  5 KI
  Tab Delimited (TSV)   2D SDfile   Computed 3D by Vconf -m prep SDfile
Find this compound or compounds like it in BindingDB:
Activity Spreadsheet -- Enzyme Inhibition Constant Data from BindingDB
Found 5 hits for monomerid = 50052885
TargetPhenylethanolamine N-methyltransferase(Bos taurus (bovine))
University Of Kansas
Curated by ChEMBL
LigandPNGBDBM50052885((R)-3-Methyl-1,2,3,4-tetrahydro-isoquinoline | CHE...)
Affinity DataKi:  1.00E+3nM. Assay description: In vitro inhibition of PNMT (Phenylethanolamine N-Methyltransferase).
In DepthDetails ArticlePubMed
LigandPNGBDBM50052885((R)-3-Methyl-1,2,3,4-tetrahydro-isoquinoline | CHE...)
Affinity DataKi:  5.30E+3nM. Assay description: Inhibition of [3H]clonidine binding to the rat alpha-2-adrenoceptor
In DepthDetails ArticlePubMed
TargetPhenylethanolamine N-methyltransferase(Bos taurus (bovine))
University Of Kansas
Curated by ChEMBL
LigandPNGBDBM50052885((R)-3-Methyl-1,2,3,4-tetrahydro-isoquinoline | CHE...)
Affinity DataKi:  1.20E+4nM. Assay description: Inhibitory activity against bovine adrenal phenylethanolamine N-methyl-transferase (PNMT)
In DepthDetails ArticlePubMed
TargetPhenylethanolamine N-methyltransferase(Bos taurus (bovine))
University Of Kansas
Curated by ChEMBL
LigandPNGBDBM50052885((R)-3-Methyl-1,2,3,4-tetrahydro-isoquinoline | CHE...)
Affinity DataKi:  3.80E+4nM. Assay description: In vitro inhibitory activity against bovine adrenal phenylethanolamine N-methyl transferase
In DepthDetails ArticlePubMed
TargetPhenylethanolamine N-methyltransferase(Bos taurus (bovine))
University Of Kansas
Curated by ChEMBL
LigandPNGBDBM50052885((R)-3-Methyl-1,2,3,4-tetrahydro-isoquinoline | CHE...)
Affinity DataKi:  3.83E+4nM. Assay description: In vitro for inhibition of Phenylethanolamine N-Methyltransferase (PNMT)
In DepthDetails ArticlePubMed