BDBM50052978 2-[6-(3-Chloro-phenyl)-hexylsulfanylmethyl]-2-hydroxy-succinic acid::CHEMBL116544
SMILES OC(=O)CC(O)(CSCCCCCCc1cccc(Cl)c1)C(O)=O
InChI Key InChIKey=VNHFSRKVNYVZQK-UHFFFAOYSA-N
Data  1 KI
  Tab Delimited (TSV)   2D SDfile   Computed 3D by Vconf -m prep SDfile
Find this compound or compounds like it in BindingDB:
Activity Spreadsheet -- Enzyme Inhibition Constant Data from BindingDB
Found 1 hit for monomerid = 50052978
TargetATP-citrate synthase(Rattus norvegicus)
Smithkline Beecham Pharmaceuticals
Curated by ChEMBL
LigandPNGBDBM50052978(2-[6-(3-Chloro-phenyl)-hexylsulfanylmethyl]-2-hydr...)
Affinity DataKi:  1.50E+5nM. Assay description: Inhibitory activity against rat ATP-citrate lyase activity by the maleate dehydrogenase catalyzed reduction of oxaloacetate by NADH.
In DepthDetails ArticlePubMed