BDBM50053069 (2S,3S,4R)-3-Carboxymethyl-4-(1-phenyl-vinyl)-pyrrolidine-2-carboxylic acid::CHEMBL121194
SMILES OC(=O)C[C@H]1[C@@H](CN[C@@H]1C(O)=O)C(=C)c1ccccc1
InChI Key InChIKey=RXXFWIJAVLCIFQ-OBJOEFQTSA-N
Data  2 KI
  Tab Delimited (TSV)   2D SDfile   Computed 3D by Vconf -m prep SDfile
Find this compound or compounds like it in BindingDB:
Activity Spreadsheet -- Enzyme Inhibition Constant Data from BindingDB
Found 2 hits for monomerid = 50053069
TargetGlutamate receptor ionotropic, kainate 2(Rattus norvegicus)
Eli Lilly
Curated by ChEMBL
LigandPNGBDBM50053069((2S,3S,4R)-3-Carboxymethyl-4-(1-phenyl-vinyl)-pyrr...)
Affinity DataKi:  230nM. Assay description: Inhibition of [3H]-kainate binding at rat forebrain ionotropic glutamate receptor kainate 2
In DepthDetails ArticlePubMed
TargetGlutamate receptor ionotropic, kainate 2(Homo sapiens (Human))
Eli Lilly
Curated by ChEMBL
LigandPNGBDBM50053069((2S,3S,4R)-3-Carboxymethyl-4-(1-phenyl-vinyl)-pyrr...)
Affinity DataKi:  6.97E+3nM. Assay description: Inhibition of [3H]-kainate binding at ionotropic glutamate receptor kainate 2
In DepthDetails ArticlePubMed