BDBM50053177 (2S,3S,5R)-3-Methyl-4,4,7-trioxo-3-((Z)-3-oxo-but-1-enyl)-4lambda*6*-thia-1-aza-bicyclo[3.2.0]heptane-2-carboxylic acid::CHEMBL124960
SMILES CC(=O)C=C[C@@]1(C)[C@@H](N2[C@@H](CC2=O)S1(=O)=O)C(O)=O
InChI Key InChIKey=YXTACWPFRBTXGO-YWVKMMECSA-N
Data  3 IC50
  Tab Delimited (TSV)   2D SDfile   Computed 3D by Vconf -m prep SDfile
Find this compound or compounds like it in BindingDB:
Activity Spreadsheet -- Enzyme Inhibition Constant Data from BindingDB
Found 3 hits for monomerid = 50053177
TargetBeta-lactamase(Enterobacter cloacae)
F. Hoffmann-La Roche
Curated by ChEMBL
LigandPNGBDBM50053177((2S,3S,5R)-3-Methyl-4,4,7-trioxo-3-((Z)-3-oxo-but-...)
Affinity DataIC50:  3.00E+3nM. Assay description: Compound was tested for inhibition of Escherichia coli AmpC ,class C of Beta-lactamase
In DepthDetails ArticlePubMed
TargetBeta-lactamase(Enterobacter cloacae)
F. Hoffmann-La Roche
Curated by ChEMBL
LigandPNGBDBM50053177((2S,3S,5R)-3-Methyl-4,4,7-trioxo-3-((Z)-3-oxo-but-...)
Affinity DataIC50:  1.10E+3nM. Assay description: Compound was tested for inhibition of Pseudomonas aeruginosa 18SH ,class C of Beta-lactamase
In DepthDetails ArticlePubMed
TargetBeta-lactamase(Enterobacter cloacae)
F. Hoffmann-La Roche
Curated by ChEMBL
LigandPNGBDBM50053177((2S,3S,5R)-3-Methyl-4,4,7-trioxo-3-((Z)-3-oxo-but-...)
Affinity DataIC50:  150nM. Assay description: Compound was tested for inhibition of Citrobacter freundii 1928, class C of Beta-lactamase
In DepthDetails ArticlePubMed