BDBM50053637 3-(4-Ethynyl-phenyl)-8-aza-bicyclo[3.2.1]octane-2-carboxylic acid methyl ester::CHEMBL442763
SMILES COC(=O)C1C2CCC(CC1c1ccc(cc1)C#C)N2
InChI Key InChIKey=TYFSSZYOVLRLQK-UHFFFAOYSA-N
Data  3 IC50
  Tab Delimited (TSV)   2D SDfile   Computed 3D by Vconf -m prep SDfile
Find this compound or compounds like it in BindingDB:
Activity Spreadsheet -- Enzyme Inhibition Constant Data from BindingDB
Found 3 hits for monomerid = 50053637
TargetTransporter(Rattus norvegicus)
Research Triangle Institute
Curated by ChEMBL
LigandPNGBDBM50053637(3-(4-Ethynyl-phenyl)-8-aza-bicyclo[3.2.1]octane-2-...)
Affinity DataIC50:  22nM. Assay description: Inhibition of [3H]nisoxetine binding to the norepinephrine transporter in rat midbrain.
In DepthDetails ArticlePubMed
TargetSodium-dependent dopamine transporter(Rattus norvegicus (rat))
Research Triangle Institute
Curated by ChEMBL
LigandPNGBDBM50053637(3-(4-Ethynyl-phenyl)-8-aza-bicyclo[3.2.1]octane-2-...)
Affinity DataIC50:  1.20nM. Assay description: Inhibition of [3H]WIN-35428 binding to the dopamine transporter in rat striata.
In DepthDetails ArticlePubMed
TargetSodium-dependent serotonin transporter(Rattus norvegicus (rat))
Research Triangle Institute
Curated by ChEMBL
LigandPNGBDBM50053637(3-(4-Ethynyl-phenyl)-8-aza-bicyclo[3.2.1]octane-2-...)
Affinity DataIC50:  1.60nM. Assay description: Inhibition of [3H]paroxetine binding to serotonin transporter in rat frontal cortex
In DepthDetails ArticlePubMed