BDBM50053811 CHEMBL338957::Morpholine-4-carboxylic acid [1-(1-ethylaminooxalyl-propylcarbamoyl)-3-methyl-butyl]-amide
SMILES CCNC(=O)C(=O)C(CC)NC(=O)C(CC(C)C)NC(=O)N1CCOCC1
InChI Key InChIKey=FLFBCKMXGDATMM-UHFFFAOYSA-N
Data  3 KI
  Tab Delimited (TSV)   2D SDfile   Computed 3D by Vconf -m prep SDfile
Find this compound or compounds like it in BindingDB:
Activity Spreadsheet -- Enzyme Inhibition Constant Data from BindingDB
Found 3 hits for monomerid = 50053811
TargetCathepsin B(Bos taurus (bovine))
Georgia Institute Of Technology
Curated by ChEMBL
LigandPNGBDBM50053811(CHEMBL338957 | Morpholine-4-carboxylic acid [1-(1-...)
Affinity DataKi:  4.30E+3nM. Assay description: Inhibition of bovine cathepsin B
In DepthDetails ArticlePubMed
TargetCalpain-1 catalytic subunit(Homo sapiens (Human))
Georgia Institute Of Technology
Curated by ChEMBL
LigandPNGBDBM50053811(CHEMBL338957 | Morpholine-4-carboxylic acid [1-(1-...)
Affinity DataKi:  7.90E+3nM. Assay description: Inhibition of the cysteine protease human Calpain 1
In DepthDetails ArticlePubMed
TargetCalpain-2 catalytic subunit(Homo sapiens (Human))
Georgia Institute Of Technology
Curated by ChEMBL
LigandPNGBDBM50053811(CHEMBL338957 | Morpholine-4-carboxylic acid [1-(1-...)
Affinity DataKi:  9.90E+3nM. Assay description: Compound was evaluated for the inhibition of Cysteine protease Calpain 2
In DepthDetails ArticlePubMed