BDBM50053888 CHEMBL85156::N,N'-Diallyl-6-{4-[2,2-bis-(4-fluoro-phenyl)-ethylamino]-piperidin-1-yl}-[1,3,5]triazine-2,4-diamine::N,N'-Diallyl-6-{4-[2,2-bis-(4-fluoro-phenyl)-ethylamino]-piperidin-1-yl}-[1,3,5]triazine-2,4-diamine; H2O::S-9788
SMILES Fc1ccc(cc1)C(CNC1CCN(CC1)c1nc(NCC=C)nc(NCC=C)n1)c1ccc(F)cc1
InChI Key InChIKey=GERNFWKTMKWULM-UHFFFAOYSA-N
Data  1 KI
  Tab Delimited (TSV)   2D SDfile   Computed 3D by Vconf -m prep SDfile
Find this compound or compounds like it in BindingDB:
Activity Spreadsheet -- Enzyme Inhibition Constant Data from BindingDB
Found 1 hit for monomerid = 50053888
TargetVoltage-dependent L-type calcium channel subunit alpha-1S(Rattus norvegicus)
Institut De Recherches Servier
Curated by ChEMBL
LigandPNGBDBM50053888(CHEMBL85156 | N,N'-Diallyl-6-{4-[2,2-bis-(4-fluoro...)
Affinity DataKi:  89nM. Assay description: Inhibition of [3H]-D-888 binding to L-type [Ca2+] channel of membranes from rat skeletal muscle
In DepthDetails ArticlePubMed