BDBM50053931 CHEMBL93932::N-(9-Chloro-2-furan-2-yl-[1,2,4]triazolo[1,5-c]quinazolin-5-yl)-3-iodo-benzamide
SMILES Clc1ccc2nc(NC(=O)c3cccc(I)c3)n3nc(nc3c2c1)-c1ccco1
InChI Key InChIKey=USMWYBNSYYRRNA-UHFFFAOYSA-N
Data  3 KI
  Tab Delimited (TSV)   2D SDfile   Computed 3D by Vconf -m prep SDfile
Find this compound or compounds like it in BindingDB:
Activity Spreadsheet -- Enzyme Inhibition Constant Data from BindingDB
Found 3 hits for monomerid = 50053931
TargetAdenosine receptor A3(Homo sapiens (Human))
National Institute Of Diabetes
Curated by ChEMBL
LigandPNGBDBM50053931(CHEMBL93932 | N-(9-Chloro-2-furan-2-yl-[1,2,4]tria...)
Affinity DataKi:  23.8nM. Assay description: In vitro binding affinity at human Adenosine A3 receptor from HEK-293 cells by [125I]-AB-MECA displacement.
In DepthDetails ArticlePubMed
TargetAdenosine receptor A1(Rattus norvegicus (rat))
National Institute Of Diabetes
Curated by ChEMBL
LigandPNGBDBM50053931(CHEMBL93932 | N-(9-Chloro-2-furan-2-yl-[1,2,4]tria...)
Affinity DataKi:  200nM. Assay description: Displacement of [3H]-¿-PIA from Adenosine A1 receptor of rat cerebral cortex membranes
In DepthDetails ArticlePubMed
TargetAdenosine receptor A2a(Rattus norvegicus (rat))
National Institute Of Diabetes
Curated by ChEMBL
LigandPNGBDBM50053931(CHEMBL93932 | N-(9-Chloro-2-furan-2-yl-[1,2,4]tria...)
Affinity DataKi:  310nM. Assay description: Displacement of [3H]-CGH 21680 from Adenosine A2A receptor of rat striatal membranes
In DepthDetails ArticlePubMed