BDBM50054080 ((R)-7-Methoxy-1,2,3,4-tetrahydro-naphthalen-2-yl)-propyl-amine::CHEMBL335971
SMILES CCCN[C@@H]1CCc2ccc(OC)cc2C1
InChI Key InChIKey=RMRODALMKPMZFW-CYBMUJFWSA-N
Data  3 KI
  Tab Delimited (TSV)   2D SDfile   Computed 3D by Vconf -m prep SDfile
Find this compound or compounds like it in BindingDB:
Activity Spreadsheet -- Enzyme Inhibition Constant Data from BindingDB
Found 3 hits for monomerid = 50054080
TargetD(3) dopamine receptor(Homo sapiens (Human))
University Of Groningen
Curated by ChEMBL
LigandPNGBDBM50054080(((R)-7-Methoxy-1,2,3,4-tetrahydro-naphthalen-2-yl)...)
Affinity DataKi:  1.37E+3nM. Assay description: Binding affinity was evaluated by calculating competition for [3H]spiperone binding on Dopamine receptor D3 expressed on CHO K-1 cells.
In DepthDetails ArticlePubMed
TargetD(4) dopamine receptor(Homo sapiens (Human))
University Of Groningen
Curated by ChEMBL
LigandPNGBDBM50054080(((R)-7-Methoxy-1,2,3,4-tetrahydro-naphthalen-2-yl)...)
Affinity DataKi: >3.33E+3nM. Assay description: Binding affinity was evaluated by calculating competition for [3H]spiperone binding on Dopamine receptor D4.2 of CHO K-1 cells.
In DepthDetails ArticlePubMed
TargetD(2) dopamine receptor(Homo sapiens (Human))
University Of Groningen
Curated by ChEMBL
LigandPNGBDBM50054080(((R)-7-Methoxy-1,2,3,4-tetrahydro-naphthalen-2-yl)...)
Affinity DataKi:  5.89E+4nM. Assay description: Binding affinity was evaluated by calculating competition for [3H]spiperone binding on Dopamine receptor D2L of CHO K-1 cells.
In DepthDetails ArticlePubMed