BDBM50054099 CHEMBL3319539
SMILES Nc1ccc(cn1)S(=O)(=O)N1CCN(CC1)c1ncc(cc1-c1ccoc1)C(O)(C(F)(F)F)C(F)(F)F
InChI Key InChIKey=QGQJZMHESTYQND-UHFFFAOYSA-N
Data  1 IC50  1 EC50
  Tab Delimited (TSV)   2D SDfile   Computed 3D by Vconf -m prep SDfile
Find this compound or compounds like it in BindingDB:
Activity Spreadsheet -- Enzyme Inhibition Constant Data from BindingDB
Found 2 hits for monomerid = 50054099
TargetHexokinase-4(Mus musculus (Mouse))
Amgen
Curated by ChEMBL
LigandPNGBDBM50054099(CHEMBL3319539)
Affinity DataEC50:  1.73E+3nM. Assay description: Induction of GK translocation from nucleus to cytoplasm of mouse hepatocytes preincubated for 20 mins followed by glucose challenge measured after 40...
In DepthDetails ArticlePubMed
TargetHexokinase-4(Homo sapiens (Human))
Amgen
Curated by ChEMBL
LigandPNGBDBM50054099(CHEMBL3319539)
Affinity DataIC50:  19nM. Assay description: Inhibition of fluorescein-labeled human GK interaction with biotin-labeled human GKRP compound incubated for 20 mins prior to addition of fluorescein...
In DepthDetails ArticlePubMed