BDBM50054588 (Z)-2-Cyano-3-cyclopropyl-3-hydroxy-N-(4-methanesulfinyl-phenyl)-acrylamide::CHEMBL357498
SMILES CS(=O)c1ccc(NC(=O)C(C#N)C(=O)C2CC2)cc1
InChI Key InChIKey=HODJUNLDOQWOKF-UHFFFAOYSA-N
Data  2 IC50
  Tab Delimited (TSV)   2D SDfile   Computed 3D by Vconf -m prep SDfile
Find this compound or compounds like it in BindingDB:
Activity Spreadsheet -- Enzyme Inhibition Constant Data from BindingDB
Found 2 hits for monomerid = 50054588
TargetDihydroorotate dehydrogenase (quinone), mitochondrial(Rattus norvegicus (rat))
Hoechst Marion Roussel
Curated by ChEMBL
LigandPNGBDBM50054588((Z)-2-Cyano-3-cyclopropyl-3-hydroxy-N-(4-methanesu...)
Affinity DataIC50:  832nM. Assay description: Inhibitory concentration tested against enzyme dihydroorotate dehydrogenase in rat
In DepthDetails ArticlePubMed
TargetDihydroorotate dehydrogenase (quinone), mitochondrial(Mus musculus)
Hoechst Marion Roussel
Curated by ChEMBL
LigandPNGBDBM50054588((Z)-2-Cyano-3-cyclopropyl-3-hydroxy-N-(4-methanesu...)
Affinity DataIC50:  2.24E+4nM. Assay description: Inhibitory concentration tested on enzyme dihydroorotate dehydrogenase in mouse
In DepthDetails ArticlePubMed