BDBM50054795 CHEMBL3318997
SMILES COc1cnc2ccc(=O)n(CCN3CCC(CC3)c3nc4cc(C#N)c(C)cc4[nH]3)c2c1
InChI Key InChIKey=QPIAIQHJZYBDGV-UHFFFAOYSA-N
Data  6 IC50
  Tab Delimited (TSV)   2D SDfile   Computed 3D by Vconf -m prep SDfile
Find this compound or compounds like it in BindingDB:
Activity Spreadsheet -- Enzyme Inhibition Constant Data from BindingDB
Found 6 hits for monomerid = 50054795
TargetCytochrome P450 1A2(Homo sapiens (Human))
Astrazeneca
Curated by ChEMBL
LigandPNGBDBM50054795(CHEMBL3318997)
Affinity DataIC50: >3.00E+4nM. Assay description: Inhibition of CYP1A2 (unknown origin)
In DepthDetails ArticlePubMed
TargetCytochrome P450 2C9(Homo sapiens (Human))
Astrazeneca
Curated by ChEMBL
LigandPNGBDBM50054795(CHEMBL3318997)
Affinity DataIC50: >3.00E+4nM. Assay description: Inhibition of CYP2C9 (unknown origin)
In DepthDetails ArticlePubMed
TargetPotassium voltage-gated channel subfamily H member 2(Homo sapiens (Human))
Astrazeneca
Curated by ChEMBL
LigandPNGBDBM50054795(CHEMBL3318997)
Affinity DataIC50:  1.00E+4nM. Assay description: Inhibition of human ERG by electrophysiology assay
In DepthDetails ArticlePubMed
TargetCytochrome P450 2D6(Homo sapiens (Human))
Astrazeneca
Curated by ChEMBL
LigandPNGBDBM50054795(CHEMBL3318997)
Affinity DataIC50:  2.80E+4nM. Assay description: Inhibition of CYP2D6 (unknown origin)
In DepthDetails ArticlePubMed
TargetCytochrome P450 3A4(Homo sapiens (Human))
Astrazeneca
Curated by ChEMBL
LigandPNGBDBM50054795(CHEMBL3318997)
Affinity DataIC50:  9.40E+3nM. Assay description: Inhibition of CYP3A4 (unknown origin)
In DepthDetails ArticlePubMed
TargetCytochrome P450 2C19(Homo sapiens (Human))
Astrazeneca
Curated by ChEMBL
LigandPNGBDBM50054795(CHEMBL3318997)
Affinity DataIC50: >3.00E+4nM. Assay description: Inhibition of CYP2C19 (unknown origin)
In DepthDetails ArticlePubMed