BDBM50055131 CHEMBL422666::bicyclic N-hydroxy urea derivatives
SMILES CCc1ccc2n3CCC(N(O)C(N)=O)c3cc2c1
InChI Key InChIKey=PYGZFJMMSNFLMZ-UHFFFAOYSA-N
Data  1 IC50
  Tab Delimited (TSV)   2D SDfile   Computed 3D by Vconf -m prep SDfile
Find this compound or compounds like it in BindingDB:
Activity Spreadsheet -- Enzyme Inhibition Constant Data from BindingDB
Found 1 hit for monomerid = 50055131
TargetPolyunsaturated fatty acid 5-lipoxygenase(Rattus norvegicus)
Smithkline Beecham Pharmaceuticals
Curated by ChEMBL
LigandPNGBDBM50055131(CHEMBL422666 | bicyclic N-hydroxy urea derivatives)
Affinity DataIC50:  1.70E+3nM. Assay description: Inhibitory activity against rat 5-lipoxygenase by using continuous oxygen consumption assay.
In DepthDetails ArticlePubMed