BDBM50055132 CHEMBL146715::N-Hydroxy-N-[2,3-dihydro-5-(4-methoxy benzyloxy)-1H-inden-1yl]urea
SMILES COc1ccc(COc2ccc3C(CCc3c2)N(O)C(N)=O)cc1
InChI Key InChIKey=INILUFMQFDTJIN-UHFFFAOYSA-N
Data  1 IC50
  Tab Delimited (TSV)   2D SDfile   Computed 3D by Vconf -m prep SDfile
Find this compound or compounds like it in BindingDB:
Activity Spreadsheet -- Enzyme Inhibition Constant Data from BindingDB
Found 1 hit for monomerid = 50055132
TargetPolyunsaturated fatty acid 5-lipoxygenase(Rattus norvegicus)
Smithkline Beecham Pharmaceuticals
Curated by ChEMBL
LigandPNGBDBM50055132(CHEMBL146715 | N-Hydroxy-N-[2,3-dihydro-5-(4-metho...)
Affinity DataIC50:  1.40E+3nM. Assay description: Inhibitory activity against rat 5-lipoxygenase by using continuous oxygen consumption assay.
In DepthDetails ArticlePubMed