BDBM50055137 CHEMBL149926::bicyclic N-hydroxy urea derivatives
SMILES NC(=O)N(O)C1CCn2c1cc1ccccc21
InChI Key InChIKey=AXZRMFZAEOCMRX-UHFFFAOYSA-N
Data  1 IC50
  Tab Delimited (TSV)   2D SDfile   Computed 3D by Vconf -m prep SDfile
Find this compound or compounds like it in BindingDB:
Activity Spreadsheet -- Enzyme Inhibition Constant Data from BindingDB
Found 1 hit for monomerid = 50055137
TargetPolyunsaturated fatty acid 5-lipoxygenase(Rattus norvegicus)
Smithkline Beecham Pharmaceuticals
Curated by ChEMBL
LigandPNGBDBM50055137(CHEMBL149926 | bicyclic N-hydroxy urea derivatives)
Affinity DataIC50:  1.00E+4nM. Assay description: Inhibitory activity against rat 5-lipoxygenase by using continuous oxygen consumption assay.
In DepthDetails ArticlePubMed