BDBM50055146 4-(2-{(E)-3-[1-(1-Isobutyl-3-methyl-butyl)-1H-indol-5-yl]-pent-2-enoylamino}-phenoxy)-butyric acid::CHEMBL146803
SMILES CC\C(=C/C(=O)Nc1ccccc1OCCCC(O)=O)c1ccc2n(ccc2c1)C(CC(C)C)CC(C)C
InChI Key InChIKey=VOSCTQFUSMMLAP-DARPEHSRSA-N
Data  1 IC50
  Tab Delimited (TSV)   2D SDfile   Computed 3D by Vconf -m prep SDfile
Find this compound or compounds like it in BindingDB:
Activity Spreadsheet -- Enzyme Inhibition Constant Data from BindingDB
Found 1 hit for monomerid = 50055146
Target3-oxo-5-alpha-steroid 4-dehydrogenase 1(Rattus norvegicus)
Kyowa Hakko Kogyo
Curated by ChEMBL
LigandPNGBDBM50055146(4-(2-{(E)-3-[1-(1-Isobutyl-3-methyl-butyl)-1H-indo...)
Affinity DataIC50:  4.80E+3nM. Assay description: 5 alpha- reductase inhibitory activity
In DepthDetails ArticlePubMed