BDBM50055222 1-Methyl-2,3-dioxo-2,3-dihydro-1H-indole-5-carboxylic acid methylamide::CHEMBL357319
SMILES CNC(=O)c1ccc2N(C)C(=O)C(=O)c2c1
InChI Key InChIKey=LQWQFWDSRGNXMV-UHFFFAOYSA-N
Data  1 KI
  Tab Delimited (TSV)   2D SDfile   Computed 3D by Vconf -m prep SDfile
Find this compound or compounds like it in BindingDB:
Activity Spreadsheet -- Enzyme Inhibition Constant Data from BindingDB
Found 1 hit for monomerid = 50055222
TargetGenome polyprotein(Human rhinovirus B)
Agouron Pharmaceuticals
Curated by ChEMBL
LigandPNGBDBM50055222(1-Methyl-2,3-dioxo-2,3-dihydro-1H-indole-5-carboxy...)
Affinity DataKi:  1.20E+4nM. Assay description: Inhibition of human rhinovirus 3C protease
In DepthDetails ArticlePubMed