BDBM50055223 5-Chloro-1-methyl-1H-indole-2,3-dione::CHEMBL344320
SMILES CN1C(=O)C(=O)c2cc(Cl)ccc12
InChI Key InChIKey=NJOPQQPDPYWFFA-UHFFFAOYSA-N
Data  1 KI
  Tab Delimited (TSV)   2D SDfile   Computed 3D by Vconf -m prep SDfile
Find this compound or compounds like it in BindingDB:
Activity Spreadsheet -- Enzyme Inhibition Constant Data from BindingDB
Found 1 hit for monomerid = 50055223
TargetGenome polyprotein(Human rhinovirus B)
Agouron Pharmaceuticals
Curated by ChEMBL
LigandPNGBDBM50055223(5-Chloro-1-methyl-1H-indole-2,3-dione | CHEMBL3443...)
Affinity DataKi:  5.90E+4nM. Assay description: Inhibition of human rhinovirus 3C protease
In DepthDetails ArticlePubMed