BDBM50055427 (S)-4-[[[4-[[[5[(sec-phenylamino)methyl]2,4-dihydroxy-3,6-dimethylphenyl]carbonyl]oxy]-2-methoxy-3,5,6-trimethylphenyl]carbonyl]-2-methoxy-3,5,6-trimethylphenyl]carbonyl]oxy]-2-methoxy-3,5,6-trimethylbenzoic acid::CHEMBL346413
SMILES C[C@H](NCc1c(C)c(C(=O)Oc2c(C)c(C)c(C(=O)OC3C(C)C(=O)C(C(O)=O)C(C)=C3C)c(O)c2C)c(O)c(C)c1O)c1ccccc1
InChI Key InChIKey=POIKEMMKDLPDBZ-HPPNUCPUSA-N
Data  3 IC50
  Tab Delimited (TSV)   2D SDfile   Computed 3D by Vconf -m prep SDfile
Find this compound or compounds like it in BindingDB:
Activity Spreadsheet -- Enzyme Inhibition Constant Data from BindingDB
Found 3 hits for monomerid = 50055427
TargetPhospholipase A2(Homo sapiens (Human))
Shionogi
Curated by ChEMBL
LigandPNGBDBM50055427((S)-4-[[[4-[[[5[(sec-phenylamino)methyl]2,4-dihydr...)
Affinity DataIC50:  6.00E+7nM. Assay description: In vitro inhibition of human recombinant secretory Phospholipase A2 (group I).
In DepthDetails ArticlePubMed
TargetPhospholipase A2, membrane associated(Homo sapiens (Human))
Shionogi
Curated by ChEMBL
LigandPNGBDBM50055427((S)-4-[[[4-[[[5[(sec-phenylamino)methyl]2,4-dihydr...)
Affinity DataIC50:  8.40E+5nM. Assay description: In vitro inhibition of human recombinant secretory Phospholipase A2 (group II).
In DepthDetails ArticlePubMed
TargetPhospholipase A2, membrane associated(Rattus norvegicus)
Shionogi
Curated by ChEMBL
LigandPNGBDBM50055427((S)-4-[[[4-[[[5[(sec-phenylamino)methyl]2,4-dihydr...)
Affinity DataIC50:  3.60E+5nM. Assay description: In vitro inhibition of rat secretory Phospholipase A2 (group II).
In DepthDetails ArticlePubMed