BDBM50055438 CHEMBL3323699
SMILES CCCCCc1cc(O)cc(OCCCCCCCCCCCNCC=C)c1
InChI Key InChIKey=GEAPPRKVLAAFQO-UHFFFAOYSA-N
Data  2 KI
  Tab Delimited (TSV)   2D SDfile   Computed 3D by Vconf -m prep SDfile
Find this compound or compounds like it in BindingDB:
Activity Spreadsheet -- Enzyme Inhibition Constant Data from BindingDB
Found 2 hits for monomerid = 50055438
TargetCannabinoid receptor 1(Homo sapiens (Human))
Universit£
Curated by ChEMBL
LigandPNGBDBM50055438(CHEMBL3323699)
Affinity DataKi:  1.14E+3nM. Assay description: Displacement of [3H]CP-55,940 from human recombinant CB1 receptor expressed in HEK293 cell membranes
In DepthDetails ArticlePubMed
TargetCannabinoid receptor 2(Homo sapiens (Human))
Universit£
Curated by ChEMBL
LigandPNGBDBM50055438(CHEMBL3323699)
Affinity DataKi:  1.85E+3nM. Assay description: Displacement of [3H]CP-55,940 from human recombinant CB2 receptor expressed in HEK293 cell membranes
In DepthDetails ArticlePubMed