BDBM50055472 CHEMBL356173::[4-(3-Ethoxy-pyridin-2-yl)-piperazin-1-yl]-(1H-indol-2-yl)-methanone
SMILES CCOc1cccnc1N1CCN(CC1)C(=O)c1cc2ccccc2[nH]1
InChI Key InChIKey=NWMIXFOVOGAALM-UHFFFAOYSA-N
Data  1 IC50
  Tab Delimited (TSV)   2D SDfile   Computed 3D by Vconf -m prep SDfile
Find this compound or compounds like it in BindingDB:
Activity Spreadsheet -- Enzyme Inhibition Constant Data from BindingDB
Found 1 hit for monomerid = 50055472
TargetReverse transcriptase/RNaseH(Human immunodeficiency virus 1)
Pharmacia & Upjohn
Curated by ChEMBL
LigandPNGBDBM50055472(CHEMBL356173 | [4-(3-Ethoxy-pyridin-2-yl)-piperazi...)
Affinity DataIC50:  2.10E+3nM. Assay description: In vitro for inhibition of HIV-1 reverse transcriptase.
In DepthDetails ArticlePubMed