BDBM50055501 CHEMBL3326257
SMILES CCCn1c2c(nc(Cc3cccc4ccccc34)c1=O)n(CC(C)C)c(=O)n(C)c2=O
InChI Key InChIKey=IZRLGBMJKWZZDY-UHFFFAOYSA-N
Data  1 IC50
  Tab Delimited (TSV)   2D SDfile   Computed 3D by Vconf -m prep SDfile
Find this compound or compounds like it in BindingDB:
Activity Spreadsheet -- Enzyme Inhibition Constant Data from BindingDB
Found 1 hit for monomerid = 50055501
TargetMonocarboxylate transporter 1(Homo sapiens (Human))
The Scripps Research Institute
Curated by ChEMBL
LigandPNGBDBM50055501(CHEMBL3326257)
Affinity DataIC50: >2.00E+3nM. Assay description: Inhibition of MCT1 (unknown origin) overexpressed in human MCF7 cells assessed as inhibition of transporter-mediated [14C]lactate transport after 10 ...
In DepthDetails ArticlePubMed