BDBM50055504 CHEMBL3326264
SMILES CC(C)Cn1c2nc(Cc3cccc4ccccc34)c(CCCCO)nc2c(=O)n(C)c1=O
InChI Key InChIKey=ZIXNDXQDSKUSQC-UHFFFAOYSA-N
Data  1 IC50
  Tab Delimited (TSV)   2D SDfile   Computed 3D by Vconf -m prep SDfile
Find this compound or compounds like it in BindingDB:
Activity Spreadsheet -- Enzyme Inhibition Constant Data from BindingDB
Found 1 hit for monomerid = 50055504
TargetMonocarboxylate transporter 1(Homo sapiens (Human))
The Scripps Research Institute
Curated by ChEMBL
LigandPNGBDBM50055504(CHEMBL3326264)
Affinity DataIC50: >2.00E+3nM. Assay description: Inhibition of MCT1 (unknown origin) overexpressed in human MCF7 cells assessed as inhibition of transporter-mediated [14C]lactate transport after 10 ...
In DepthDetails ArticlePubMed