BDBM50055582 CHEMBL3325644
SMILES CCCC(=O)c1cnn(c1C)-c1ccc(NC(=O)c2cn(CC(=O)N3CCC(N)CC3)c3ccc(C)cc23)cc1
InChI Key InChIKey=GENRFUBUGXWJNT-UHFFFAOYSA-N
Data  2 IC50
  Tab Delimited (TSV)   2D SDfile   Computed 3D by Vconf -m prep SDfile
Find this compound or compounds like it in BindingDB:
Activity Spreadsheet -- Enzyme Inhibition Constant Data from BindingDB
Found 2 hits for monomerid = 50055582
TargetP2Y purinoceptor 12(Homo sapiens (Human))
Sanofi R & D
Curated by ChEMBL
LigandPNGBDBM50055582(CHEMBL3325644)
Affinity DataIC50:  71nM. Assay description: Displacement of [33P]2MeS-ADP from P2Y12 receptor (unknown origin) transfected in CHO cells after 30 mins by scintillation counting analysis
In DepthDetails ArticlePubMed
TargetP2Y purinoceptor 12(Rattus norvegicus)
Sanofi R & D
Curated by ChEMBL
LigandPNGBDBM50055582(CHEMBL3325644)
Affinity DataIC50:  800nM. Assay description: Antagonist activity at P2Y12 receptor in Sprague-Dawley rat platelet rich plasma assessed as inhibition of ADP-induced aggregation
In DepthDetails ArticlePubMed