BDBM50055719 3-{4-[2-(4-Pyridin-2-yl-piperazin-1-yl)-ethyl]-cyclohexyl}-1H-indol-5-ol::CHEMBL313095
SMILES Oc1ccc2[nH]cc([C@H]3CC[C@H](CCN4CCN(CC4)c4ccccn4)CC3)c2c1
InChI Key InChIKey=GQXBPSLBHRQMDR-MXVIHJGJSA-N
Data  1 KI
  Tab Delimited (TSV)   2D SDfile   Computed 3D by Vconf -m prep SDfile
Find this compound or compounds like it in BindingDB:
Activity Spreadsheet -- Enzyme Inhibition Constant Data from BindingDB
Found 1 hit for monomerid = 50055719
TargetD(2) dopamine receptor(Rattus norvegicus (rat))
Division Of Warner Lambert
Curated by ChEMBL
LigandPNGBDBM50055719(3-{4-[2-(4-Pyridin-2-yl-piperazin-1-yl)-ethyl]-cyc...)
Affinity DataKi:  8.60nM. Assay description: In vitro binding affinity for dopamine receptor D2 on rat striatal membranes by [3H]-spiperone displacement.
In DepthDetails ArticlePubMed