BDBM50055831 (1H-Benzoimidazol-5-yl)-(1H-imidazol-2-yl)-amine::CHEMBL74544
SMILES N(c1ncc[nH]1)c1ccc2nc[nH]c2c1
InChI Key InChIKey=NFSIDEIKDWWMOX-UHFFFAOYSA-N
Data  3 KI
  Tab Delimited (TSV)   2D SDfile   Computed 3D by Vconf -m prep SDfile
Find this compound or compounds like it in BindingDB:
Activity Spreadsheet -- Enzyme Inhibition Constant Data from BindingDB
Found 3 hits for monomerid = 50055831
TargetAlpha-2A adrenergic receptor(Homo sapiens (Human))
Allergan
Curated by ChEMBL
LigandPNGBDBM50055831((1H-Benzoimidazol-5-yl)-(1H-imidazol-2-yl)-amine |...)
Affinity DataKi:  76nM. Assay description: Displacement of rauwolscine from human Alpha-2A adrenergic receptor expressed in CHO cells
In DepthDetails ArticlePubMed
TargetAlpha-2C adrenergic receptor(Homo sapiens (Human))
Allergan
Curated by ChEMBL
LigandPNGBDBM50055831((1H-Benzoimidazol-5-yl)-(1H-imidazol-2-yl)-amine |...)
Affinity DataKi:  400nM. Assay description: Displacement of rauwolscine from human Alpha-2C adrenergic receptor expressed in CHO cells
In DepthDetails ArticlePubMed
TargetAlpha-2B adrenergic receptor(NEONATAL RAT)
Allergan
Curated by ChEMBL
LigandPNGBDBM50055831((1H-Benzoimidazol-5-yl)-(1H-imidazol-2-yl)-amine |...)
Affinity DataKi:  640nM. Assay description: Displacement of rauwolscine from rat Alpha-2B adrenergic receptor expressed in CHO cells
In DepthDetails ArticlePubMed