BDBM50056104 CHEMBL3326689
SMILES Cc1nc(ccc1Oc1ncnc(OC2CCN(CC2)C(=O)c2ncc(Cl)cn2)c1F)S(C)(=O)=O
InChI Key InChIKey=BPXJSGIERMPYKH-UHFFFAOYSA-N
Data  2 EC50
  Tab Delimited (TSV)   2D SDfile   Computed 3D by Vconf -m prep SDfile
Find this compound or compounds like it in BindingDB:
Activity Spreadsheet -- Enzyme Inhibition Constant Data from BindingDB
Found 2 hits for monomerid = 50056104
TargetGlucose-dependent insulinotropic receptor(Rattus norvegicus)
Arena Pharmaceuticals
Curated by ChEMBL
LigandPNGBDBM50056104(CHEMBL3326689)
Affinity DataEC50:  31nM. Assay description: Inhibition of rat GPR119 activity by homogeneous time resolved fluorescence cyclase (cAMP) assay
In DepthDetails ArticlePubMed
TargetGlucose-dependent insulinotropic receptor(Homo sapiens (Human))
Arena Pharmaceuticals
Curated by ChEMBL
LigandPNGBDBM50056104(CHEMBL3326689)
Affinity DataEC50:  6.10nM. Assay description: Inhibition of human GPR119 activity by homogeneous time resolved fluorescence cyclase (cAMP) assay
In DepthDetails ArticlePubMed