BDBM50056151 CHEMBL3329668
SMILES COc1ccc(cc1)C(=O)NC(=O)Nc1ccc2\C(=C\c3[nH]c(C)c(CC(O)=O)c3C)C(=O)Nc2c1
InChI Key InChIKey=OFEKPPBEFBIIGB-JAIQZWGSSA-N
Data  2 IC50
  Tab Delimited (TSV)   2D SDfile   Computed 3D by Vconf -m prep SDfile
Find this compound or compounds like it in BindingDB:
Activity Spreadsheet -- Enzyme Inhibition Constant Data from BindingDB
Found 2 hits for monomerid = 50056151
TargetReceptor-type tyrosine-protein kinase FLT3(Homo sapiens (Human))
National Taiwan University
Curated by ChEMBL
LigandPNGBDBM50056151(CHEMBL3329668)
Affinity DataIC50:  32nM. Assay description: Inhibition of FLT3 (unknown origin) using EAIYAAPFAKKK substrate
In DepthDetails ArticlePubMed
TargetAurora kinase B(Homo sapiens (Human))
National Taiwan University
Curated by ChEMBL
LigandPNGBDBM50056151(CHEMBL3329668)
Affinity DataIC50:  1.80nM. Assay description: Inhibition of Aurora B (unknown origin) using HLRRASLG substrate
In DepthDetails ArticlePubMed