BDBM50056178 CHEMBL3329660
SMILES FC(F)(F)c1cc(ccc1Cl)C(=O)NC(=O)Nc1ccc2\C(=C\c3ccc[nH]3)C(=O)Nc2c1
InChI Key InChIKey=TWGQOAACISTFEJ-DHDCSXOGSA-N
Data  2 IC50
  Tab Delimited (TSV)   2D SDfile   Computed 3D by Vconf -m prep SDfile
Find this compound or compounds like it in BindingDB:
Activity Spreadsheet -- Enzyme Inhibition Constant Data from BindingDB
Found 2 hits for monomerid = 50056178
TargetReceptor-type tyrosine-protein kinase FLT3(Homo sapiens (Human))
National Taiwan University
Curated by ChEMBL
LigandPNGBDBM50056178(CHEMBL3329660)
Affinity DataIC50:  385nM. Assay description: Inhibition of FLT3 (unknown origin) using EAIYAAPFAKKK substrate
In DepthDetails ArticlePubMed
TargetAurora kinase B(Homo sapiens (Human))
National Taiwan University
Curated by ChEMBL
LigandPNGBDBM50056178(CHEMBL3329660)
Affinity DataIC50:  15nM. Assay description: Inhibition of Aurora B (unknown origin) using HLRRASLG substrate
In DepthDetails ArticlePubMed