BDBM50056197 CHEMBL3329682
SMILES COc1ccc(C(=O)NC(=O)Nc2ccc3\C(=C\c4[nH]c(C)c(C(=O)NCCN(C)C)c4C)C(=O)Nc3c2)c(F)c1
InChI Key InChIKey=TVBBUHNPXVGJKW-STZFKDTASA-N
Data  2 IC50
  Tab Delimited (TSV)   2D SDfile   Computed 3D by Vconf -m prep SDfile
Find this compound or compounds like it in BindingDB:
Activity Spreadsheet -- Enzyme Inhibition Constant Data from BindingDB
Found 2 hits for monomerid = 50056197
TargetReceptor-type tyrosine-protein kinase FLT3(Homo sapiens (Human))
National Taiwan University
Curated by ChEMBL
LigandPNGBDBM50056197(CHEMBL3329682)
Affinity DataIC50:  16nM. Assay description: Inhibition of FLT3 (unknown origin) using EAIYAAPFAKKK substrate
In DepthDetails ArticlePubMed
TargetAurora kinase B(Homo sapiens (Human))
National Taiwan University
Curated by ChEMBL
LigandPNGBDBM50056197(CHEMBL3329682)
Affinity DataIC50:  11nM. Assay description: Inhibition of Aurora B (unknown origin) using HLRRASLG substrate
In DepthDetails ArticlePubMed