BDBM50056308 CHEMBL3317932
SMILES COc1cc(OC)c(cc1OC)C(=O)Nc1ccc(cc1F)-c1ccncc1
InChI Key InChIKey=HZAQMWWEOYQOMR-UHFFFAOYSA-N
Data  2 IC50
  Tab Delimited (TSV)   2D SDfile   Computed 3D by Vconf -m prep SDfile
Find this compound or compounds like it in BindingDB:
Activity Spreadsheet -- Enzyme Inhibition Constant Data from BindingDB
Found 2 hits for monomerid = 50056308
TargetMultidrug resistance-associated protein 1(Homo sapiens (Human))
Universit£
Curated by ChEMBL
LigandPNGBDBM50056308(CHEMBL3317932)
Affinity DataIC50: >1.00E+5nM. Assay description: Inhibition of MRP1 (unknown origin) expressed in MDCK cells after 30 mins by Calcein-AM assay
In DepthDetails ArticlePubMed
TargetATP-dependent translocase ABCB1(Homo sapiens (Human))
Universit£
Curated by ChEMBL
LigandPNGBDBM50056308(CHEMBL3317932)
Affinity DataIC50:  310nM. Assay description: Inhibition of MDR1 (unknown origin) expressed in MDCK cells after 30 mins by Calcein-AM assay
In DepthDetails ArticlePubMed