BDBM50056343 CHEMBL3322513
SMILES OC(=O)c1cc(F)ccc1S(=O)(=O)NCCCCN1C(=O)c2cccc3cccc(C1=O)c23
InChI Key InChIKey=OLNHPZQHEJGYNC-UHFFFAOYSA-N
Data  1 EC50
  Tab Delimited (TSV)   2D SDfile   Computed 3D by Vconf -m prep SDfile
Find this compound or compounds like it in BindingDB:
Activity Spreadsheet -- Enzyme Inhibition Constant Data from BindingDB
Found 1 hit for monomerid = 50056343
TargetLysophosphatidic acid receptor 2(Homo sapiens (Human))
The University Of Tennessee Health Science Center
Curated by ChEMBL
LigandPNGBDBM50056343(CHEMBL3322513)
Affinity DataEC50:  0.150nM. Assay description: Agonist activity at human LPA2 expressed in LPA1xLPA2 double knockout mouse MEF cells by Fura-2AM dye based Ca2+ mobilization assay
In DepthDetails ArticlePubMed