BDBM50056720 CHEMBL3326958
SMILES NC(=O)CCc1ccc2n(cc(CCc3ccccc3)c2c1)-c1ccccc1
InChI Key InChIKey=WQJKOHQLJXHYMV-UHFFFAOYSA-N
Data  1 IC50
  Tab Delimited (TSV)   2D SDfile   Computed 3D by Vconf -m prep SDfile
Find this compound or compounds like it in BindingDB:
Activity Spreadsheet -- Enzyme Inhibition Constant Data from BindingDB
Found 1 hit for monomerid = 50056720
TargetCytosolic phospholipase A2(Homo sapiens (Human))
Asubio Pharma
Curated by ChEMBL
LigandPNGBDBM50056720(CHEMBL3326958)
Affinity DataIC50: >1.00E+5nM. Assay description: Inhibition of cPLA2alpha isolated from human U937 cell cytoplasm assessed as suppression of [14C]arachidonic acid release from L-alpha-1-palmitoyl-2-...
In DepthDetails ArticlePubMed