BDBM50056721 CHEMBL3326957
SMILES C(Cc1ccc2n(cc(CCc3ccccc3)c2c1)-c1ccccc1)c1nnn[nH]1
InChI Key InChIKey=XCXOKNFAUKJNHT-UHFFFAOYSA-N
Data  1 IC50
  Tab Delimited (TSV)   2D SDfile   Computed 3D by Vconf -m prep SDfile
Find this compound or compounds like it in BindingDB:
Activity Spreadsheet -- Enzyme Inhibition Constant Data from BindingDB
Found 1 hit for monomerid = 50056721
TargetCytosolic phospholipase A2(Homo sapiens (Human))
Asubio Pharma
Curated by ChEMBL
LigandPNGBDBM50056721(CHEMBL3326957)
Affinity DataIC50:  1.30E+4nM. Assay description: Inhibition of cPLA2alpha isolated from human U937 cell cytoplasm assessed as suppression of [14C]arachidonic acid release from L-alpha-1-palmitoyl-2-...
In DepthDetails ArticlePubMed