BDBM50057450 CHEMBL3322804::US9127027, 12::US9422318, 12
SMILES CCCCCNC(=O)NCCCC\C=C/CCCCCNS(=O)(=O)c1ccccc1
InChI Key InChIKey=HFXDODUDEXSROA-PLNGDYQASA-N
Data  3 IC50
  Tab Delimited (TSV)   2D SDfile   Computed 3D by Vconf -m prep SDfile
Find this compound or compounds like it in BindingDB:
Activity Spreadsheet -- Enzyme Inhibition Constant Data from BindingDB
Found 3 hits for monomerid = 50057450
TargetBifunctional epoxide hydrolase 2(Homo sapiens (Human))
The Medical College Of Wisconsin
US Patent
LigandPNGBDBM50057450(CHEMBL3322804 | US9127027, 12 | US9422318, 12)
Affinity DataIC50:  32nM. Assay description: Compounds were tested for their ability to inhibit recombinant soluble epoxide hydrolase (sEH) protein. The assay utilizes (3-Phhenyl-oxiranyl)-aceti...
In DepthDetails US Patent
TargetBifunctional epoxide hydrolase 2(Homo sapiens (Human))
The Medical College Of Wisconsin
US Patent
LigandPNGBDBM50057450(CHEMBL3322804 | US9127027, 12 | US9422318, 12)
Affinity DataIC50:  32nM. Assay description: Inhibition of recombinant human sEH using CMNPC substrate by fluoresecent-based assay
In DepthDetails ArticlePubMed
TargetBifunctional epoxide hydrolase 2(Homo sapiens (Human))
The Medical College Of Wisconsin
US Patent
LigandPNGBDBM50057450(CHEMBL3322804 | US9127027, 12 | US9422318, 12)
Affinity DataIC50:  32nM. Assay description: Compounds were tested for their ability to inhibit recombinant soluble epoxide hydrolase (sEH) protein. The assay utilizes (3-Phhenyl-oxiranyl)-aceti...
In DepthDetails US Patent