BDBM50057482 4-(2-{4-[(S)-1-(4-Isobutyl-phenyl)-ethoxy]-2,3-dimethyl-benzoylamino}-phenoxy)-butyric acid::4-(2-{4-[1-(4-Isobutyl-phenyl)-ethoxy]-2,3-dimethyl-benzoylamino}-phenoxy)-butyric acid::CHEMBL24470::ONO-3805
SMILES CC(C)Cc1ccc(cc1)[C@H](C)Oc1ccc(C(=O)Nc2ccccc2OCCCC(O)=O)c(C)c1C
InChI Key InChIKey=XWNSOVPLENXWNU-QHCPKHFHSA-N
Data  3 IC50
  Tab Delimited (TSV)   2D SDfile   Computed 3D by Vconf -m prep SDfile
Find this compound or compounds like it in BindingDB:
Activity Spreadsheet -- Enzyme Inhibition Constant Data from BindingDB
Found 3 hits for monomerid = 50057482
Target3-oxo-5-alpha-steroid 4-dehydrogenase 2(Homo sapiens (Human))
Pfizer
Curated by ChEMBL
LigandPNGBDBM50057482(4-(2-{4-[(S)-1-(4-Isobutyl-phenyl)-ethoxy]-2,3-dim...)
Affinity DataIC50:  256nM. Assay description: Inhibition of human 5-alpha reductase 2 isozyme.
In DepthDetails ArticlePubMed
Target3-oxo-5-alpha-steroid 4-dehydrogenase 1/2(Rattus norvegicus)
Zeria Pharmaceutical
Curated by ChEMBL
LigandPNGBDBM50057482(4-(2-{4-[(S)-1-(4-Isobutyl-phenyl)-ethoxy]-2,3-dim...)
Affinity DataIC50:  2.60nM. Assay description: Inhibition of Steroid 5-alpha-reductase from Dawley rat prostate
In DepthDetails ArticlePubMed
Target3-oxo-5-alpha-steroid 4-dehydrogenase 2(Rattus norvegicus)
Kyowa Hakko Kogyo
Curated by ChEMBL
LigandPNGBDBM50057482(4-(2-{4-[(S)-1-(4-Isobutyl-phenyl)-ethoxy]-2,3-dim...)
Affinity DataIC50:  180nM. Assay description: Compound was tested in vitro for inhibitory activity against type 1 5-alpha reductase Isozyme homogenated from rat epididymis
In DepthDetails ArticlePubMed