BDBM50057494 CHEMBL3322814::US9127027, 20::US9127027, LGK-I-119-15::US9422318, LGK-I-119-15
SMILES CCCCCNC(=O)NCCCC\C=C/CCCCCCc1nnn[nH]1
InChI Key InChIKey=UZTSWDCBHOBEFC-ALCCZGGFSA-N
Data  5 IC50
  Tab Delimited (TSV)   2D SDfile   Computed 3D by Vconf -m prep SDfile
Find this compound or compounds like it in BindingDB:
Activity Spreadsheet -- Enzyme Inhibition Constant Data from BindingDB
Found 5 hits for monomerid = 50057494
TargetBifunctional epoxide hydrolase 2(Homo sapiens (Human))
The Medical College Of Wisconsin
US Patent
LigandPNGBDBM50057494(CHEMBL3322814 | US9127027, 20 | US9127027, LGK-I-1...)
Affinity DataIC50:  11nM. Assay description: Compounds were tested for their ability to inhibit recombinant soluble epoxide hydrolase (sEH) protein. The assay utilizes (3-Phhenyl-oxiranyl)-aceti...
In DepthDetails US Patent
TargetBifunctional epoxide hydrolase 2(Homo sapiens (Human))
The Medical College Of Wisconsin
US Patent
LigandPNGBDBM50057494(CHEMBL3322814 | US9127027, 20 | US9127027, LGK-I-1...)
Affinity DataIC50:  11nM. Assay description: Compounds were tested for their ability to inhibit recombinant soluble epoxide hydrolase (sEH) protein. The assay utilizes (3-Phhenyl-oxiranyl)-aceti...
In DepthDetails US Patent
TargetBifunctional epoxide hydrolase 2(Homo sapiens (Human))
The Medical College Of Wisconsin
US Patent
LigandPNGBDBM50057494(CHEMBL3322814 | US9127027, 20 | US9127027, LGK-I-1...)
Affinity DataIC50:  11nM. Assay description: Inhibition of recombinant human sEH using CMNPC substrate by fluoresecent-based assay
In DepthDetails ArticlePubMed
TargetBifunctional epoxide hydrolase 2(Homo sapiens (Human))
The Medical College Of Wisconsin
US Patent
LigandPNGBDBM50057494(CHEMBL3322814 | US9127027, 20 | US9127027, LGK-I-1...)
Affinity DataIC50:  11nM. Assay description: Compounds were tested for their ability to inhibit recombinant soluble epoxide hydrolase (sEH) protein. The assay utilizes (3-Phhenyl-oxiranyl)-aceti...
In DepthDetails US Patent
TargetBifunctional epoxide hydrolase 2(Homo sapiens (Human))
The Medical College Of Wisconsin
US Patent
LigandPNGBDBM50057494(CHEMBL3322814 | US9127027, 20 | US9127027, LGK-I-1...)
Affinity DataIC50:  11nM. Assay description: Compounds were tested for their ability to inhibit recombinant soluble epoxide hydrolase (sEH) protein. The assay utilizes (3-Phhenyl-oxiranyl)-aceti...
In DepthDetails US Patent