BDBM50057693 (S)-6-Amino-2-((S)-2-{2-[4-(5-amino-pentyl)-phenyl]-acetylamino}-3-hydroxy-propionylamino)-hexanoic acid (2-cyclohexyl-ethyl)-amide::CHEMBL416405
SMILES NCCCCCc1ccc(CC(=O)N[C@@H](CO)C(=O)N[C@@H](CCCCN)C(=O)NCCC2CCCCC2)cc1
InChI Key InChIKey=KRGQYFMUAVBAPT-SVBPBHIXSA-N
Data  1 IC50
  Tab Delimited (TSV)   2D SDfile   Computed 3D by Vconf -m prep SDfile
Find this compound or compounds like it in BindingDB:
Activity Spreadsheet -- Enzyme Inhibition Constant Data from BindingDB
Found 1 hit for monomerid = 50057693
TargetGlycylpeptide N-tetradecanoyltransferase(Candida albicans (Yeast))
G. D. Searle Research And Development
Curated by ChEMBL
LigandPNGBDBM50057693((S)-6-Amino-2-((S)-2-{2-[4-(5-amino-pentyl)-phenyl...)
Affinity DataIC50:  190nM. Assay description: Inhibitory activity against N-myristoyltransferase (NMT) of candida albicans
In DepthDetails ArticlePubMed